{"text_format":"1","workbook":"xlsx","n_sheets":11,"sheets":["INSTRUCTIONS","DASHBOARD","LOG","Current Stock Med Air vs Usage","Stock","Stock Use Per Location","Stock Check to Order","Cylinders","Locations","Current Stock Oxygen vs Usage","Stock Audit"],"not_rendered":{"charts":5,"images":3,"macros":1,"external_links":1,"defined_names":12,"comments":0,"pivot_tables":7},"unopened":[],"bounds":{"document_bytes":16777216,"sheet_cells":100000,"rows_first":2000,"rows_last":500,"rows_between":2000,"halvings":0,"cell_chars":16384,"cell_head_chars":4096},"cells_cut":0,"cells_raw":0,"read":"whole","date_system":"1900"}

{"sheet":"INSTRUCTIONS","index":0,"n_rows":1,"n_cols":1,"rows_kept":1,"cut":false,"hidden":false,"merged":[[38,0,38,3],[39,0,39,3],[31,0,31,3],[32,0,32,3],[33,0,33,3],[34,0,34,3],[35,0,35,3],[37,0,37,3],[24,0,24,3],[25,0,25,3],[26,0,26,3],[27,0,27,3],[28,0,28,3],[29,0,29,3],[18,0,18,3],[19,0,19,3],[20,0,20,3],[21,0,21,3],[22,0,22,3],[23,0,23,3],[12,0,12,3],[13,0,13,3],[14,0,14,3],[15,0,15,3],[16,0,16,3],[17,0,17,3],[0,0,0,3],[1,0,1,3],[3,0,3,3],[6,0,6,3],[7,0,7,3],[10,0,10,3]]}
["DOUBLE CLICK BELOW TO OPEN INSTRUCTIONS"]

{"sheet":"DASHBOARD","index":1,"n_rows":43,"n_cols":50,"rows_kept":43,"cut":false,"hidden":false,"merged":[]}
[]
[]
[]
[]
[]
[null,"Row Labels","Item","Current (Cyl)","Current (Ltrs)","To Order"]
[null,"Oxygen","Oxy PD4C",0,0,{"$f":"IF(D7=\"\",\"\",IF(VLOOKUP(C7,Cylinders!A:D,3,FALSE)>D7,VLOOKUP(C7,Cylinders!A:D,3,FALSE)-D7,0))","v":0}]
[null,null,"Oxy E",0,0,{"$f":"IF(D8=\"\",\"\",IF(VLOOKUP(C8,Cylinders!A:D,3,FALSE)>D8,VLOOKUP(C8,Cylinders!A:D,3,FALSE)-D8,0))","v":0}]
[null,null,"Oxy F4",0,0,{"$f":"IF(D9=\"\",\"\",IF(VLOOKUP(C9,Cylinders!A:D,3,FALSE)>D9,VLOOKUP(C9,Cylinders!A:D,3,FALSE)-D9,0))","v":0},null,null,null,null,null,null,null,null,null,null,null,null,null,null,null,null,null,null,null,null,null,null,null,null,null,null,null,null,null,null,null,null,null,null,null,null,"Action","Opening Stock"]
[null,null,"Oxy F4C1T",0,0,{"$f":"IF(D10=\"\",\"\",IF(VLOOKUP(C10,Cylinders!A:D,3,FALSE)>D10,VLOOKUP(C10,Cylinders!A:D,3,FALSE)-D10,0))","v":0}]
[null,null,"Oxy G",0,0,{"$f":"IF(D11=\"\",\"\",IF(VLOOKUP(C11,Cylinders!A:D,3,FALSE)>D11,VLOOKUP(C11,Cylinders!A:D,3,FALSE)-D11,0))","v":0},null,null,null,null,null,null,null,null,null,null,null,null,null,null,null,null,null,null,null,null,null,null,null,null,null,null,null,null,null,null,null,null,null,null,null,null,"Sum of Total Cap (Ltr)","Column Labels"]
[null,null,"Oxy SJ",0,0,{"$f":"IF(D12=\"\",\"\",IF(VLOOKUP(C12,Cylinders!A:D,3,FALSE)>D12,VLOOKUP(C12,Cylinders!A:D,3,FALSE)-D12,0))","v":0},null,null,null,null,null,null,null,null,null,null,null,null,null,null,null,null,null,null,null,null,null,null,null,null,null,null,null,null,null,null,null,null,null,null,null,null,"Row Labels","CO2","Medical Air","Nitrous Oxide","Oxygen","Entonox","Helium","Grand Total"]
[null,null,"Oxy CD",0,0,{"$f":"IF(D13=\"\",\"\",IF(VLOOKUP(C13,Cylinders!A:D,3,FALSE)>D13,VLOOKUP(C13,Cylinders!A:D,3,FALSE)-D13,0))","v":0},null,null,null,null,null,null,null,null,null,null,null,null,null,null,null,null,null,null,null,null,null,null,null,null,null,null,null,null,null,null,null,null,null,null,null,null,"2020-04-20",0,0,0,0,0,0,0]
[null,null,"Oxy D",0,0,{"$f":"IF(D14=\"\",\"\",IF(VLOOKUP(C14,Cylinders!A:D,3,FALSE)>D14,VLOOKUP(C14,Cylinders!A:D,3,FALSE)-D14,0))","v":0},null,null,null,null,null,null,null,null,null,null,null,null,null,null,null,null,null,null,null,null,null,null,null,null,null,null,null,null,null,null,null,null,null,null,null,null,"Grand Total",0,0,0,0,0,0,0]
[null,null,"Oxy HX",0,0,{"$f":"IF(D15=\"\",\"\",IF(VLOOKUP(C15,Cylinders!A:D,3,FALSE)>D15,VLOOKUP(C15,Cylinders!A:D,3,FALSE)-D15,0))","v":0}]
{"$rows_left_out":29}
{"sheet":"LOG","index":2,"n_rows":42,"n_cols":13,"rows_kept":42,"cut":false,"hidden":false,"merged":[]}
["Date","Week Commencing","Action","Item","Location","Quantity","Cyl Cap (Ltr)","Total Cap (Ltr)","Stock Move","Capacity Move (Ltr)","Issue","Current Stock","Gas Type"]
["2020-04-22",{"$f":"IF(Table1[[#This Row],[Date]]=\"\",\"\",Table1[[#This Row],[Date]]-WEEKDAY(Table1[[#This Row],[Date]],2)+1)","v":"2020-04-20"},"Opening Stock","Oxy PD4C","Stock",0,{"$f":"IF(Table1[[#This Row],[Item]]=\"\",\"\",VLOOKUP(Table1[[#This Row],[Item]],Cylinders!A:B,2,FALSE))","v":430},{"$f":"IF(Table1[[#This Row],[Cyl Cap (Ltr)]]=\"\",\"\",Table1[[#This Row],[Cyl Cap (Ltr)]]*Table1[[#This Row],[Quantity]])","v":0},{"$f":"IF(IF(Table1[[#This Row],[Action]]=\"Issue\",Table1[[#This Row],[Quantity]]*-1,Table1[[#This Row],[Quantity]])=0,IF(Table1[[#This Row],[Quantity]]<>\"\",0,\"\"),IF(Table1[[#This Row],[Action]]=\"Issue\",Table1[[#This Row],[Quantity]]*-1,Table1[[#This Row],[Quantity]]))","v":0},{"$f":"IF(Table1[[#This Row],[Cyl Cap (Ltr)]]=\"\",\"\",Table1[[#This Row],[Cyl Cap (Ltr)]]*Table1[[#This Row],[Stock Move]])","v":0},{"$f":"IF(Table1[[#This Row],[Action]]=\"Issue\",Table1[[#This Row],[Quantity]],0)","v":0},{"$f":"SUMIF(D:D,Table1[[#This Row],[Item]],I:I)","v":0},{"$f":"IF(Table1[[#This Row],[Item]]=\"\",\"\",VLOOKUP(Table1[[#This Row],[Item]],Cylinders!A:D,4,FALSE))","v":"Oxygen"}]
["2020-04-22",{"$f":"IF(Table1[[#This Row],[Date]]=\"\",\"\",Table1[[#This Row],[Date]]-WEEKDAY(Table1[[#This Row],[Date]],2)+1)","v":"2020-04-20"},"Opening Stock","Oxy CD","Stock",0,{"$f":"IF(Table1[[#This Row],[Item]]=\"\",\"\",VLOOKUP(Table1[[#This Row],[Item]],Cylinders!A:B,2,FALSE))","v":460},{"$f":"IF(Table1[[#This Row],[Cyl Cap (Ltr)]]=\"\",\"\",Table1[[#This Row],[Cyl Cap (Ltr)]]*Table1[[#This Row],[Quantity]])","v":0},{"$f":"IF(IF(Table1[[#This Row],[Action]]=\"Issue\",Table1[[#This Row],[Quantity]]*-1,Table1[[#This Row],[Quantity]])=0,IF(Table1[[#This Row],[Quantity]]<>\"\",0,\"\"),IF(Table1[[#This Row],[Action]]=\"Issue\",Table1[[#This Row],[Quantity]]*-1,Table1[[#This Row],[Quantity]]))","v":0},{"$f":"IF(Table1[[#This Row],[Cyl Cap (Ltr)]]=\"\",\"\",Table1[[#This Row],[Cyl Cap (Ltr)]]*Table1[[#This Row],[Stock Move]])","v":0},{"$f":"IF(Table1[[#This Row],[Action]]=\"Issue\",Table1[[#This Row],[Quantity]],0)","v":0},{"$f":"SUMIF(D:D,Table1[[#This Row],[Item]],I:I)","v":0},{"$f":"IF(Table1[[#This Row],[Item]]=\"\",\"\",VLOOKUP(Table1[[#This Row],[Item]],Cylinders!A:D,4,FALSE))","v":"Oxygen"}]
["2020-04-22",{"$f":"IF(Table1[[#This Row],[Date]]=\"\",\"\",Table1[[#This Row],[Date]]-WEEKDAY(Table1[[#This Row],[Date]],2)+1)","v":"2020-04-20"},"Opening Stock","Oxy D","Stock",0,{"$f":"IF(Table1[[#This Row],[Item]]=\"\",\"\",VLOOKUP(Table1[[#This Row],[Item]],Cylinders!A:B,2,FALSE))","v":340},{"$f":"IF(Table1[[#This Row],[Cyl Cap (Ltr)]]=\"\",\"\",Table1[[#This Row],[Cyl Cap (Ltr)]]*Table1[[#This Row],[Quantity]])","v":0},{"$f":"IF(IF(Table1[[#This Row],[Action]]=\"Issue\",Table1[[#This Row],[Quantity]]*-1,Table1[[#This Row],[Quantity]])=0,IF(Table1[[#This Row],[Quantity]]<>\"\",0,\"\"),IF(Table1[[#This Row],[Action]]=\"Issue\",Table1[[#This Row],[Quantity]]*-1,Table1[[#This Row],[Quantity]]))","v":0},{"$f":"IF(Table1[[#This Row],[Cyl Cap (Ltr)]]=\"\",\"\",Table1[[#This Row],[Cyl Cap (Ltr)]]*Table1[[#This Row],[Stock Move]])","v":0},{"$f":"IF(Table1[[#This Row],[Action]]=\"Issue\",Table1[[#This Row],[Quantity]],0)","v":0},{"$f":"SUMIF(D:D,Table1[[#This Row],[Item]],I:I)","v":0},{"$f":"IF(Table1[[#This Row],[Item]]=\"\",\"\",VLOOKUP(Table1[[#This Row],[Item]],Cylinders!A:D,4,FALSE))","v":"Oxygen"}]
["2020-04-22",{"$f":"IF(Table1[[#This Row],[Date]]=\"\",\"\",Table1[[#This Row],[Date]]-WEEKDAY(Table1[[#This Row],[Date]],2)+1)","v":"2020-04-20"},"Opening Stock","Oxy E","Stock",0,{"$f":"IF(Table1[[#This Row],[Item]]=\"\",\"\",VLOOKUP(Table1[[#This Row],[Item]],Cylinders!A:B,2,FALSE))","v":680},{"$f":"IF(Table1[[#This Row],[Cyl Cap (Ltr)]]=\"\",\"\",Table1[[#This Row],[Cyl Cap (Ltr)]]*Table1[[#This Row],[Quantity]])","v":0},{"$f":"IF(IF(Table1[[#This Row],[Action]]=\"Issue\",Table1[[#This Row],[Quantity]]*-1,Table1[[#This Row],[Quantity]])=0,IF(Table1[[#This Row],[Quantity]]<>\"\",0,\"\"),IF(Table1[[#This Row],[Action]]=\"Issue\",Table1[[#This Row],[Quantity]]*-1,Table1[[#This Row],[Quantity]]))","v":0},{"$f":"IF(Table1[[#This Row],[Cyl Cap (Ltr)]]=\"\",\"\",Table1[[#This Row],[Cyl Cap (Ltr)]]*Table1[[#This Row],[Stock Move]])","v":0},{"$f":"IF(Table1[[#This Row],[Action]]=\"Issue\",Table1[[#This Row],[Quantity]],0)","v":0},{"$f":"SUMIF(D:D,Table1[[#This Row],[Item]],I:I)","v":0},{"$f":"IF(Table1[[#This Row],[Item]]=\"\",\"\",VLOOKUP(Table1[[#This Row],[Item]],Cylinders!A:D,4,FALSE))","v":"Oxygen"}]
["2020-04-22",{"$f":"IF(Table1[[#This Row],[Date]]=\"\",\"\",Table1[[#This Row],[Date]]-WEEKDAY(Table1[[#This Row],[Date]],2)+1)","v":"2020-04-20"},"Opening Stock","Oxy F4","Stock",0,{"$f":"IF(Table1[[#This Row],[Item]]=\"\",\"\",VLOOKUP(Table1[[#This Row],[Item]],Cylinders!A:B,2,FALSE))","v":1360},{"$f":"IF(Table1[[#This Row],[Cyl Cap (Ltr)]]=\"\",\"\",Table1[[#This Row],[Cyl Cap (Ltr)]]*Table1[[#This Row],[Quantity]])","v":0},{"$f":"IF(IF(Table1[[#This Row],[Action]]=\"Issue\",Table1[[#This Row],[Quantity]]*-1,Table1[[#This Row],[Quantity]])=0,IF(Table1[[#This Row],[Quantity]]<>\"\",0,\"\"),IF(Table1[[#This Row],[Action]]=\"Issue\",Table1[[#This Row],[Quantity]]*-1,Table1[[#This Row],[Quantity]]))","v":0},{"$f":"IF(Table1[[#This Row],[Cyl Cap (Ltr)]]=\"\",\"\",Table1[[#This Row],[Cyl Cap (Ltr)]]*Table1[[#This Row],[Stock Move]])","v":0},{"$f":"IF(Table1[[#This Row],[Action]]=\"Issue\",Table1[[#This Row],[Quantity]],0)","v":0},{"$f":"SUMIF(D:D,Table1[[#This Row],[Item]],I:I)","v":0},{"$f":"IF(Table1[[#This Row],[Item]]=\"\",\"\",VLOOKUP(Table1[[#This Row],[Item]],Cylinders!A:D,4,FALSE))","v":"Oxygen"}]
["2020-04-22",{"$f":"IF(Table1[[#This Row],[Date]]=\"\",\"\",Table1[[#This Row],[Date]]-WEEKDAY(Table1[[#This Row],[Date]],2)+1)","v":"2020-04-20"},"Opening Stock","Oxy F4C1T","Stock",0,{"$f":"IF(Table1[[#This Row],[Item]]=\"\",\"\",VLOOKUP(Table1[[#This Row],[Item]],Cylinders!A:B,2,FALSE))","v":1360},{"$f":"IF(Table1[[#This Row],[Cyl Cap (Ltr)]]=\"\",\"\",Table1[[#This Row],[Cyl Cap (Ltr)]]*Table1[[#This Row],[Quantity]])","v":0},{"$f":"IF(IF(Table1[[#This Row],[Action]]=\"Issue\",Table1[[#This Row],[Quantity]]*-1,Table1[[#This Row],[Quantity]])=0,IF(Table1[[#This Row],[Quantity]]<>\"\",0,\"\"),IF(Table1[[#This Row],[Action]]=\"Issue\",Table1[[#This Row],[Quantity]]*-1,Table1[[#This Row],[Quantity]]))","v":0},{"$f":"IF(Table1[[#This Row],[Cyl Cap (Ltr)]]=\"\",\"\",Table1[[#This Row],[Cyl Cap (Ltr)]]*Table1[[#This Row],[Stock Move]])","v":0},{"$f":"IF(Table1[[#This Row],[Action]]=\"Issue\",Table1[[#This Row],[Quantity]],0)","v":0},{"$f":"SUMIF(D:D,Table1[[#This Row],[Item]],I:I)","v":0},{"$f":"IF(Table1[[#This Row],[Item]]=\"\",\"\",VLOOKUP(Table1[[#This Row],[Item]],Cylinders!A:D,4,FALSE))","v":"Oxygen"}]
["2020-04-22",{"$f":"IF(Table1[[#This Row],[Date]]=\"\",\"\",Table1[[#This Row],[Date]]-WEEKDAY(Table1[[#This Row],[Date]],2)+1)","v":"2020-04-20"},"Opening Stock","Oxy G","Stock",0,{"$f":"IF(Table1[[#This Row],[Item]]=\"\",\"\",VLOOKUP(Table1[[#This Row],[Item]],Cylinders!A:B,2,FALSE))","v":3400},{"$f":"IF(Table1[[#This Row],[Cyl Cap (Ltr)]]=\"\",\"\",Table1[[#This Row],[Cyl Cap (Ltr)]]*Table1[[#This Row],[Quantity]])","v":0},{"$f":"IF(IF(Table1[[#This Row],[Action]]=\"Issue\",Table1[[#This Row],[Quantity]]*-1,Table1[[#This Row],[Quantity]])=0,IF(Table1[[#This Row],[Quantity]]<>\"\",0,\"\"),IF(Table1[[#This Row],[Action]]=\"Issue\",Table1[[#This Row],[Quantity]]*-1,Table1[[#This Row],[Quantity]]))","v":0},{"$f":"IF(Table1[[#This Row],[Cyl Cap (Ltr)]]=\"\",\"\",Table1[[#This Row],[Cyl Cap (Ltr)]]*Table1[[#This Row],[Stock Move]])","v":0},{"$f":"IF(Table1[[#This Row],[Action]]=\"Issue\",Table1[[#This Row],[Quantity]],0)","v":0},{"$f":"SUMIF(D:D,Table1[[#This Row],[Item]],I:I)","v":0},{"$f":"IF(Table1[[#This Row],[Item]]=\"\",\"\",VLOOKUP(Table1[[#This Row],[Item]],Cylinders!A:D,4,FALSE))","v":"Oxygen"}]
["2020-04-22",{"$f":"IF(Table1[[#This Row],[Date]]=\"\",\"\",Table1[[#This Row],[Date]]-WEEKDAY(Table1[[#This Row],[Date]],2)+1)","v":"2020-04-20"},"Opening Stock","Oxy HX","Stock",0,{"$f":"IF(Table1[[#This Row],[Item]]=\"\",\"\",VLOOKUP(Table1[[#This Row],[Item]],Cylinders!A:B,2,FALSE))","v":2300},{"$f":"IF(Table1[[#This Row],[Cyl Cap (Ltr)]]=\"\",\"\",Table1[[#This Row],[Cyl Cap (Ltr)]]*Table1[[#This Row],[Quantity]])","v":0},{"$f":"IF(IF(Table1[[#This Row],[Action]]=\"Issue\",Table1[[#This Row],[Quantity]]*-1,Table1[[#This Row],[Quantity]])=0,IF(Table1[[#This Row],[Quantity]]<>\"\",0,\"\"),IF(Table1[[#This Row],[Action]]=\"Issue\",Table1[[#This Row],[Quantity]]*-1,Table1[[#This Row],[Quantity]]))","v":0},{"$f":"IF(Table1[[#This Row],[Cyl Cap (Ltr)]]=\"\",\"\",Table1[[#This Row],[Cyl Cap (Ltr)]]*Table1[[#This Row],[Stock Move]])","v":0},{"$f":"IF(Table1[[#This Row],[Action]]=\"Issue\",Table1[[#This Row],[Quantity]],0)","v":0},{"$f":"SUMIF(D:D,Table1[[#This Row],[Item]],I:I)","v":0},{"$f":"IF(Table1[[#This Row],[Item]]=\"\",\"\",VLOOKUP(Table1[[#This Row],[Item]],Cylinders!A:D,4,FALSE))","v":"Oxygen"}]
["2020-04-22",{"$f":"IF(Table1[[#This Row],[Date]]=\"\",\"\",Table1[[#This Row],[Date]]-WEEKDAY(Table1[[#This Row],[Date]],2)+1)","v":"2020-04-20"},"Opening Stock","Oxy J","Stock",0,{"$f":"IF(Table1[[#This Row],[Item]]=\"\",\"\",VLOOKUP(Table1[[#This Row],[Item]],Cylinders!A:B,2,FALSE))","v":6800},{"$f":"IF(Table1[[#This Row],[Cyl Cap (Ltr)]]=\"\",\"\",Table1[[#This Row],[Cyl Cap (Ltr)]]*Table1[[#This Row],[Quantity]])","v":0},{"$f":"IF(IF(Table1[[#This Row],[Action]]=\"Issue\",Table1[[#This Row],[Quantity]]*-1,Table1[[#This Row],[Quantity]])=0,IF(Table1[[#This Row],[Quantity]]<>\"\",0,\"\"),IF(Table1[[#This Row],[Action]]=\"Issue\",Table1[[#This Row],[Quantity]]*-1,Table1[[#This Row],[Quantity]]))","v":0},{"$f":"IF(Table1[[#This Row],[Cyl Cap (Ltr)]]=\"\",\"\",Table1[[#This Row],[Cyl Cap (Ltr)]]*Table1[[#This Row],[Stock Move]])","v":0},{"$f":"IF(Table1[[#This Row],[Action]]=\"Issue\",Table1[[#This Row],[Quantity]],0)","v":0},{"$f":"SUMIF(D:D,Table1[[#This Row],[Item]],I:I)","v":0},{"$f":"IF(Table1[[#This Row],[Item]]=\"\",\"\",VLOOKUP(Table1[[#This Row],[Item]],Cylinders!A:D,4,FALSE))","v":"Oxygen"}]
["2020-04-22",{"$f":"IF(Table1[[#This Row],[Date]]=\"\",\"\",Table1[[#This Row],[Date]]-WEEKDAY(Table1[[#This Row],[Date]],2)+1)","v":"2020-04-20"},"Opening Stock","Oxy SJ","Stock",0,{"$f":"IF(Table1[[#This Row],[Item]]=\"\",\"\",VLOOKUP(Table1[[#This Row],[Item]],Cylinders!A:B,2,FALSE))","v":7300},{"$f":"IF(Table1[[#This Row],[Cyl Cap (Ltr)]]=\"\",\"\",Table1[[#This Row],[Cyl Cap (Ltr)]]*Table1[[#This Row],[Quantity]])","v":0},{"$f":"IF(IF(Table1[[#This Row],[Action]]=\"Issue\",Table1[[#This Row],[Quantity]]*-1,Table1[[#This Row],[Quantity]])=0,IF(Table1[[#This Row],[Quantity]]<>\"\",0,\"\"),IF(Table1[[#This Row],[Action]]=\"Issue\",Table1[[#This Row],[Quantity]]*-1,Table1[[#This Row],[Quantity]]))","v":0},{"$f":"IF(Table1[[#This Row],[Cyl Cap (Ltr)]]=\"\",\"\",Table1[[#This Row],[Cyl Cap (Ltr)]]*Table1[[#This Row],[Stock Move]])","v":0},{"$f":"IF(Table1[[#This Row],[Action]]=\"Issue\",Table1[[#This Row],[Quantity]],0)","v":0},{"$f":"SUMIF(D:D,Table1[[#This Row],[Item]],I:I)","v":0},{"$f":"IF(Table1[[#This Row],[Item]]=\"\",\"\",VLOOKUP(Table1[[#This Row],[Item]],Cylinders!A:D,4,FALSE))","v":"Oxygen"}]
["2020-04-22",{"$f":"IF(Table1[[#This Row],[Date]]=\"\",\"\",Table1[[#This Row],[Date]]-WEEKDAY(Table1[[#This Row],[Date]],2)+1)","v":"2020-04-20"},"Opening Stock","Air E","Stock",0,{"$f":"IF(Table1[[#This Row],[Item]]=\"\",\"\",VLOOKUP(Table1[[#This Row],[Item]],Cylinders!A:B,2,FALSE))","v":640},{"$f":"IF(Table1[[#This Row],[Cyl Cap (Ltr)]]=\"\",\"\",Table1[[#This Row],[Cyl Cap (Ltr)]]*Table1[[#This Row],[Quantity]])","v":0},{"$f":"IF(IF(Table1[[#This Row],[Action]]=\"Issue\",Table1[[#This Row],[Quantity]]*-1,Table1[[#This Row],[Quantity]])=0,IF(Table1[[#This Row],[Quantity]]<>\"\",0,\"\"),IF(Table1[[#This Row],[Action]]=\"Issue\",Table1[[#This Row],[Quantity]]*-1,Table1[[#This Row],[Quantity]]))","v":0},{"$f":"IF(Table1[[#This Row],[Cyl Cap (Ltr)]]=\"\",\"\",Table1[[#This Row],[Cyl Cap (Ltr)]]*Table1[[#This Row],[Stock Move]])","v":0},{"$f":"IF(Table1[[#This Row],[Action]]=\"Issue\",Table1[[#This Row],[Quantity]],0)","v":0},{"$f":"SUMIF(D:D,Table1[[#This Row],[Item]],I:I)","v":0},{"$f":"IF(Table1[[#This Row],[Item]]=\"\",\"\",VLOOKUP(Table1[[#This Row],[Item]],Cylinders!A:D,4,FALSE))","v":"Medical Air"}]
["2020-04-22",{"$f":"IF(Table1[[#This Row],[Date]]=\"\",\"\",Table1[[#This Row],[Date]]-WEEKDAY(Table1[[#This Row],[Date]],2)+1)","v":"2020-04-20"},"Opening Stock","Air F","Stock",0,{"$f":"IF(Table1[[#This Row],[Item]]=\"\",\"\",VLOOKUP(Table1[[#This Row],[Item]],Cylinders!A:B,2,FALSE))","v":1280},{"$f":"IF(Table1[[#This Row],[Cyl Cap (Ltr)]]=\"\",\"\",Table1[[#This Row],[Cyl Cap (Ltr)]]*Table1[[#This Row],[Quantity]])","v":0},{"$f":"IF(IF(Table1[[#This Row],[Action]]=\"Issue\",Table1[[#This Row],[Quantity]]*-1,Table1[[#This Row],[Quantity]])=0,IF(Table1[[#This Row],[Quantity]]<>\"\",0,\"\"),IF(Table1[[#This Row],[Action]]=\"Issue\",Table1[[#This Row],[Quantity]]*-1,Table1[[#This Row],[Quantity]]))","v":0},{"$f":"IF(Table1[[#This Row],[Cyl Cap (Ltr)]]=\"\",\"\",Table1[[#This Row],[Cyl Cap (Ltr)]]*Table1[[#This Row],[Stock Move]])","v":0},{"$f":"IF(Table1[[#This Row],[Action]]=\"Issue\",Table1[[#This Row],[Quantity]],0)","v":0},{"$f":"SUMIF(D:D,Table1[[#This Row],[Item]],I:I)","v":0},{"$f":"IF(Table1[[#This Row],[Item]]=\"\",\"\",VLOOKUP(Table1[[#This Row],[Item]],Cylinders!A:D,4,FALSE))","v":"Medical Air"}]
["2020-04-22",{"$f":"IF(Table1[[#This Row],[Date]]=\"\",\"\",Table1[[#This Row],[Date]]-WEEKDAY(Table1[[#This Row],[Date]],2)+1)","v":"2020-04-20"},"Opening Stock","Air G","Stock",0,{"$f":"IF(Table1[[#This Row],[Item]]=\"\",\"\",VLOOKUP(Table1[[#This Row],[Item]],Cylinders!A:B,2,FALSE))","v":3200},{"$f":"IF(Table1[[#This Row],[Cyl Cap (Ltr)]]=\"\",\"\",Table1[[#This Row],[Cyl Cap (Ltr)]]*Table1[[#This Row],[Quantity]])","v":0},{"$f":"IF(IF(Table1[[#This Row],[Action]]=\"Issue\",Table1[[#This Row],[Quantity]]*-1,Table1[[#This Row],[Quantity]])=0,IF(Table1[[#This Row],[Quantity]]<>\"\",0,\"\"),IF(Table1[[#This Row],[Action]]=\"Issue\",Table1[[#This Row],[Quantity]]*-1,Table1[[#This Row],[Quantity]]))","v":0},{"$f":"IF(Table1[[#This Row],[Cyl Cap (Ltr)]]=\"\",\"\",Table1[[#This Row],[Cyl Cap (Ltr)]]*Table1[[#This Row],[Stock Move]])","v":0},{"$f":"IF(Table1[[#This Row],[Action]]=\"Issue\",Table1[[#This Row],[Quantity]],0)","v":0},{"$f":"SUMIF(D:D,Table1[[#This Row],[Item]],I:I)","v":0},{"$f":"IF(Table1[[#This Row],[Item]]=\"\",\"\",VLOOKUP(Table1[[#This Row],[Item]],Cylinders!A:D,4,FALSE))","v":"Medical Air"}]
["2020-04-22",{"$f":"IF(Table1[[#This Row],[Date]]=\"\",\"\",Table1[[#This Row],[Date]]-WEEKDAY(Table1[[#This Row],[Date]],2)+1)","v":"2020-04-20"},"Opening Stock","Air J","Stock",0,{"$f":"IF(Table1[[#This Row],[Item]]=\"\",\"\",VLOOKUP(Table1[[#This Row],[Item]],Cylinders!A:B,2,FALSE))","v":6400},{"$f":"IF(Table1[[#This Row],[Cyl Cap (Ltr)]]=\"\",\"\",Table1[[#This Row],[Cyl Cap (Ltr)]]*Table1[[#This Row],[Quantity]])","v":0},{"$f":"IF(IF(Table1[[#This Row],[Action]]=\"Issue\",Table1[[#This Row],[Quantity]]*-1,Table1[[#This Row],[Quantity]])=0,IF(Table1[[#This Row],[Quantity]]<>\"\",0,\"\"),IF(Table1[[#This Row],[Action]]=\"Issue\",Table1[[#This Row],[Quantity]]*-1,Table1[[#This Row],[Quantity]]))","v":0},{"$f":"IF(Table1[[#This Row],[Cyl Cap (Ltr)]]=\"\",\"\",Table1[[#This Row],[Cyl Cap (Ltr)]]*Table1[[#This Row],[Stock Move]])","v":0},{"$f":"IF(Table1[[#This Row],[Action]]=\"Issue\",Table1[[#This Row],[Quantity]],0)","v":0},{"$f":"SUMIF(D:D,Table1[[#This Row],[Item]],I:I)","v":0},{"$f":"IF(Table1[[#This Row],[Item]]=\"\",\"\",VLOOKUP(Table1[[#This Row],[Item]],Cylinders!A:D,4,FALSE))","v":"Medical Air"}]
{"$rows_left_out":28}
{"sheet":"Current Stock Med Air vs Usage","index":3,"n_rows":10,"n_cols":5,"rows_kept":10,"cut":false,"hidden":true,"merged":[]}
[null,"Week Commencing","(All)"]
[null,"Action","(All)"]
[]
[null,"Row Labels","Item","Current Stock","Usage"]
[null,"Medical Air","Air SJ",0,0]
[null,null,"Air E",0,0]
[null,null,"Air J",0,0]
[null,null,"Air F",0,0]
[null,null,"Air G",0,0]
[null,"Grand Total",null,0,0]

{"sheet":"Stock","index":4,"n_rows":33,"n_cols":11,"rows_kept":33,"cut":false,"hidden":true,"merged":[]}
["Click in table and Alt-F5 to refresh",null,null,null,null,null,null,null,"Current Stock Oxygen"]
["Row Labels","Item","Current (Cyl)","Current (Ltrs)","To Order","Capacity 120",null,null,"Type","Usage","Current Stock"]
["Oxygen","Oxy PD4C",0,0,{"$f":"IF(C3=\"\",\"\",IF(F3-C3<0,0,F3-C3))","v":0},{"$f":"VLOOKUP(B3,Cylinders!A:D,3,FALSE)","v":0},null,null,"Oxy PD4C"]
[null,"Oxy E",0,0,{"$f":"IF(C4=\"\",\"\",IF(F4-C4<0,0,F4-C4))","v":0},{"$f":"VLOOKUP(B4,Cylinders!A:D,3,FALSE)","v":0},null,null,"Oxy E"]
[null,"Oxy F4",0,0,0,{"$f":"VLOOKUP(B5,Cylinders!A:D,3,FALSE)","v":0},null,null,"Oxy F4"]
[null,"Oxy F4C1T",0,0,0,{"$f":"VLOOKUP(B6,Cylinders!A:D,3,FALSE)","v":0},null,null,"Oxy F4C1T"]
[null,"Oxy G",0,0,0,{"$f":"VLOOKUP(B7,Cylinders!A:D,3,FALSE)","v":0},null,null,"Oxy G"]
[null,"Oxy SJ",0,0,0,{"$f":"VLOOKUP(B8,Cylinders!A:D,3,FALSE)","v":0},null,null,"Oxy SJ"]
[null,"Oxy CD",0,0,0,{"$f":"VLOOKUP(B9,Cylinders!A:D,3,FALSE)","v":0}]
[null,"Oxy D",0,0,0,{"$f":"VLOOKUP(B10,Cylinders!A:D,3,FALSE)","v":0}]
[null,"Oxy HX",0,0,0,{"$f":"VLOOKUP(B11,Cylinders!A:D,3,FALSE)","v":0}]
[null,"Oxy J",0,0,0,{"$f":"VLOOKUP(B12,Cylinders!A:D,3,FALSE)","v":0}]
["Medical Air","Air E",0,0,0,{"$f":"VLOOKUP(B13,Cylinders!A:D,3,FALSE)","v":0}]
[null,"Air F",0,0,0,{"$f":"VLOOKUP(B14,Cylinders!A:D,3,FALSE)","v":0}]
[null,"Air G",0,0,0,{"$f":"VLOOKUP(B15,Cylinders!A:D,3,FALSE)","v":0}]
{"$rows_left_out":19}
{"sheet":"Stock Use Per Location","index":5,"n_rows":7,"n_cols":15,"rows_kept":7,"cut":false,"hidden":true,"merged":[]}
["Week Commencing","2020-04-20",null,null,null,null,null,null,null,null,"Date ","Location","Cylinder Type","Issued","Qty Received"]
["Action","(All)"]
[]
["Sum of Total Cap (Ltr)","Column Labels"]
["Locations","Oxygen","Grand Total"]
["Location 1",0,0]
["Grand Total",0,0]

{"sheet":"Stock Check to Order","index":6,"n_rows":31,"n_cols":1,"rows_kept":31,"cut":false,"hidden":true,"merged":[]}
["Row Labels"]
["Oxy G"]
["Oxy PD4C"]
["Oxy E"]
["Oxy F4"]
["Oxy F4C1T"]
["Oxy SJ"]
["Air E"]
["Air F"]
["Air G"]
["Air SJ"]
["CO2 C"]
["CO2 E"]
["Equinox AD"]
["Equinox F"]
{"$rows_left_out":17}
{"sheet":"Cylinders","index":7,"n_rows":31,"n_cols":7,"rows_kept":31,"cut":false,"hidden":true,"merged":[]}
["Cylinder","Capacity","Capacity 120","GasType"]
["Oxy PD4C",430,0,"Oxygen",null,null,"Oxygen"]
["Oxy E",680,0,"Oxygen",null,null,"Medical Air"]
["Oxy F4",1360,0,"Oxygen",null,null,"CO2"]
["Oxy F4C1T",1360,0,"Oxygen",null,null,"Entonox"]
["Oxy G",3400,0,"Oxygen",null,null,"Nitrous Oxide"]
["Oxy SJ",7300,0,"Oxygen",null,null,"Helium"]
["Air E",640,0,"Medical Air"]
["Air F",1280,0,"Medical Air"]
["Air G",3200,0,"Medical Air"]
["Air SJ",6800,0,"Medical Air"]
["CO2 C",450,0,"CO2"]
["CO2 E",1800,0,"CO2"]
["Equinox AD",420,0,"Entonox"]
["Equinox F",2000,0,"Entonox"]
{"$rows_left_out":17}
{"sheet":"Locations","index":8,"n_rows":9,"n_cols":1,"rows_kept":9,"cut":false,"hidden":true,"merged":[]}
["Locations"]
["Stock"]
["Location 1"]
["Location 2"]
["Location 3"]
["Location 4"]
["Location 5"]
["Location 6"]
["Location 7"]

{"sheet":"Current Stock Oxygen vs Usage","index":9,"n_rows":15,"n_cols":5,"rows_kept":15,"cut":false,"hidden":true,"merged":[]}
[null,"Week Commencing","(All)"]
[null,"Action","(All)"]
[]
[null,"Row Labels","Item","Current Stock","Usage"]
[null,"Oxygen","Oxy D",0,0]
[null,null,"Oxy SJ",0,0]
[null,null,"Oxy J",0,0]
[null,null,"Oxy F4",0,0]
[null,null,"Oxy CD",0,0]
[null,null,"Oxy F4C1T",0,0]
[null,null,"Oxy HX",0,0]
[null,null,"Oxy G",0,0]
[null,null,"Oxy E",0,0]
[null,null,"Oxy PD4C",0,0]
[null,"Grand Total",null,0,0]
{"$rows_left_out":1}
{"sheet":"Stock Audit","index":10,"n_rows":99,"n_cols":8,"rows_kept":99,"cut":false,"hidden":true,"merged":[]}
["Item","Current (Cyl)",null,null,"Item","Current (Cyl)","Current (Cyl)","Difference"]
["Oxy PD4C",4,null,null,"Oxy PD4C",0,-41,{"$f":"B2-F2","v":4}]
["Oxy E",4,null,null,"Oxy E",0,-31,{"$f":"B3-F3","v":4}]
["Oxy F4",4,null,null,"Oxy F4",0,-35,4]
["Oxy F4C1T",4,null,null,"Oxy F4C1T",0,-40,4]
["Oxy G",4,null,null,"Oxy G",0,-24,4]
["Oxy SJ",0,null,null,"Oxy SJ",0,-17,0]
["Oxy CD",0,null,null,"Oxy CD",0,-125,0]
["Oxy D",0,null,null,"Oxy D",0,-10,0]
["Oxy HX",0,null,null,"Oxy HX",0,-6,0]
["Oxy J",0,null,null,"Oxy J",0,-14,0]
["Air E",0,null,null,"Air E",0,-46,0]
["Air F",0,null,null,"Air F",0,-39,0]
["Air G",0,null,null,"Air G",0,-45,0]
["Air SJ",0,null,null,"Air SJ",0,-15,0]
{"$rows_left_out":84}